Information card for entry 1573835
Formula | C18 H33 F6 N2 O6 P |
Calculated formula | C18 H33 F6 N2 O6 P |
Title of publication | Thermal-responsive luminescence/dielectric responses with reversibly shifted light emissions. |
Authors of publication | Zhu, Ming; Huang, Pei-Zhi; Li, Lin-Mei; Yang, Yi-Xuan; Pan, Lei; Wang, Zhi-Jie; Ni, Hao-Fei; Zhang, Feng-Wen; Teri, Gele; Zhang, Zhi-Xu; Liu, Zunqi; Fu, Da-Wei; Zhang, Yi |
Journal of publication | Chemical science |
Year of publication | 2025 |
Journal volume | 16 |
Journal issue | 9 |
Pages of publication | 4101 - 4108 |
a | 12.022 ± 0.0015 Å |
b | 10.629 ± 0.002 Å |
c | 19.921 ± 0.004 Å |
α | 90° |
β | 100.318 ± 0.013° |
γ | 90° |
Cell volume | 2504.4 ± 0.8 Å3 |
Cell temperature | 343 K |
Ambient diffraction temperature | 343 K |
Number of distinct elements | 6 |
Space group number | 14 |
Hermann-Mauguin space group symbol | P 1 21/n 1 |
Hall space group symbol | -P 2yn |
Residual factor for all reflections | 0.2332 |
Residual factor for significantly intense reflections | 0.1255 |
Weighted residual factors for significantly intense reflections | 0.2452 |
Weighted residual factors for all reflections included in the refinement | 0.2979 |
Goodness-of-fit parameter for all reflections included in the refinement | 1.043 |
Diffraction radiation wavelength | 1.54184 Å |
Diffraction radiation type | CuKα |