Information card for entry 1573838
Formula | C18 H33 F6 N2 O6 P |
Calculated formula | C18 H33 F6 N2 O6 P |
Title of publication | Thermal-responsive luminescence/dielectric responses with reversibly shifted light emissions. |
Authors of publication | Zhu, Ming; Huang, Pei-Zhi; Li, Lin-Mei; Yang, Yi-Xuan; Pan, Lei; Wang, Zhi-Jie; Ni, Hao-Fei; Zhang, Feng-Wen; Teri, Gele; Zhang, Zhi-Xu; Liu, Zunqi; Fu, Da-Wei; Zhang, Yi |
Journal of publication | Chemical science |
Year of publication | 2025 |
Journal volume | 16 |
Journal issue | 9 |
Pages of publication | 4101 - 4108 |
a | 11.985 ± 0.005 Å |
b | 10.522 ± 0.003 Å |
c | 19.813 ± 0.007 Å |
α | 90° |
β | 100.634 ± 0.018° |
γ | 90° |
Cell volume | 2455.6 ± 1.5 Å3 |
Cell temperature | 383 K |
Ambient diffraction temperature | 383 K |
Number of distinct elements | 6 |
Space group number | 14 |
Hermann-Mauguin space group symbol | P 1 21/n 1 |
Hall space group symbol | -P 2yn |
Residual factor for all reflections | 0.1736 |
Residual factor for significantly intense reflections | 0.1179 |
Weighted residual factors for significantly intense reflections | 0.2357 |
Weighted residual factors for all reflections included in the refinement | 0.2606 |
Goodness-of-fit parameter for all reflections included in the refinement | 0.986 |
Diffraction radiation wavelength | 1.54184 Å |
Diffraction radiation type | CuKα |