Information card for entry 7125573
Formula | C25 H35 Cr N2 Si2 |
Calculated formula | C25 H35 Cr N2 Si2 |
Title of publication | Cyclopentadienyl benzamidinato chromium complexes as models for alkyl halide activation by chromium reagents. |
Authors of publication | Gallant, Amanda J.; Smith, Kevin M.; Patrick, Brian O. |
Journal of publication | Chemical communications (Cambridge, England) |
Year of publication | 2002 |
Journal issue | 23 |
Pages of publication | 2914 - 2915 |
a | 11.3146 ± 0.0004 Å |
b | 21.332 ± 0.0007 Å |
c | 11.9997 ± 0.0006 Å |
α | 90° |
β | 113.493 ± 0.003° |
γ | 90° |
Cell volume | 2656.21 ± 0.19 Å3 |
Cell temperature | 173.2 K |
Ambient diffraction temperature | 173.2 K |
Number of distinct elements | 5 |
Space group number | 14 |
Hermann-Mauguin space group symbol | P 1 21/n 1 |
Hall space group symbol | -P 2yn |
Residual factor for all reflections | 0.0588 |
Residual factor for significantly intense reflections | 0.035 |
Weighted residual factors for all reflections | 0.1009 |
Weighted residual factors for all reflections included in the refinement | 0.1009 |
Goodness-of-fit parameter for all reflections | 1.153 |
Goodness-of-fit parameter for all reflections included in the refinement | 1.153 |
Diffraction radiation wavelength | 0.7107 Å |
Diffraction radiation type | MoKα |