Information card for entry 7125575
Formula | C26 H34 Cr F3 N2 Si2 |
Calculated formula | C26 H34 Cr F3.033 N2 Si2 |
Title of publication | Cyclopentadienyl benzamidinato chromium complexes as models for alkyl halide activation by chromium reagents. |
Authors of publication | Gallant, Amanda J.; Smith, Kevin M.; Patrick, Brian O. |
Journal of publication | Chemical communications (Cambridge, England) |
Year of publication | 2002 |
Journal issue | 23 |
Pages of publication | 2914 - 2915 |
a | 16.205 ± 0.002 Å |
b | 9.982 ± 0.002 Å |
c | 35.488 ± 0.003 Å |
α | 90° |
β | 97.757 ± 0.004° |
γ | 90° |
Cell volume | 5688 ± 1.4 Å3 |
Cell temperature | 173 ± 2 K |
Ambient diffraction temperature | 173 ± 2 K |
Number of distinct elements | 6 |
Space group number | 15 |
Hermann-Mauguin space group symbol | C 1 2/c 1 |
Hall space group symbol | -C 2yc |
Residual factor for all reflections | 0.0805 |
Residual factor for significantly intense reflections | 0.0567 |
Weighted residual factors for significantly intense reflections | 0.1294 |
Weighted residual factors for all reflections included in the refinement | 0.1407 |
Goodness-of-fit parameter for all reflections included in the refinement | 1.065 |
Diffraction radiation wavelength | 0.71069 Å |
Diffraction radiation type | MoKα |