Information card for entry 9013706
External links | AMCSD |
Mineral name | Pigeonite |
Formula | Al0.02 Ca0.121 Fe1.008 Mg0.871 O6 Si1.98 |
Calculated formula | Al0.02 Ca0.121 Fe1.008 Mg0.871 O6 Si1.98 |
Title of publication | High-pressure phase transition of a natural pigeonite Note: P = 0.0001 GPa |
Authors of publication | Alvaro, M.; Nestola, F.; Ballaran, T. B.; Camara, F.; Domeneghetti, M. C.; Tazzoli, V. |
Journal of publication | American Mineralogist |
Year of publication | 2010 |
Journal volume | 95 |
Pages of publication | 300 - 311 |
a | 9.749 Å |
b | 8.937 Å |
c | 5.246 Å |
α | 90° |
β | 108.49° |
γ | 90° |
Cell volume | 433.473 Å3 |
Ambient diffracton pressure | 100 kPa |
Number of distinct elements | 6 |
Space group number | 14 |
Hermann-Mauguin space group symbol | P 1 21/c 1 |
Hall space group symbol | -P 2ybc |