Information card for entry 1573832
Common name | hexagonal 4H Si-IV |
Formula | Si |
Calculated formula | Si |
Title of publication | Nature of Hexagonal Silicon Forming via High-Pressure Synthesis: Nanostructured Hexagonal 4H Polytype |
Authors of publication | Pandolfi, Silvia; Renero-Lecuna, Carlos; Le Godec, Yann; Baptiste, Benoit; Menguy, Nicolas; Lazzeri, Michele; Gervais, Christel; Spektor, Kristina; Crichton, Wilson A.; Kurakevych, Oleksandr O. |
Journal of publication | Nano Letters |
Year of publication | 2018 |
Journal volume | 18 |
Journal issue | 9 |
Pages of publication | 5989 - 5995 |
a | 3.7948 Å |
b | 3.7948 Å |
c | 12.7099 Å |
α | 90° |
β | 90° |
γ | 120° |
Cell volume | 158.508 Å3 |
Number of distinct elements | 1 |
Space group number | 194 |
Hermann-Mauguin space group symbol | P 63/m m c |
Hall space group symbol | -P 6c 2c |