Information card for entry 1573833
Formula | C18 H33 F6 N2 O6 P |
Calculated formula | C18 H33 F6 N2 O6 P |
Title of publication | Thermal-responsive luminescence/dielectric responses with reversibly shifted light emissions. |
Authors of publication | Zhu, Ming; Huang, Pei-Zhi; Li, Lin-Mei; Yang, Yi-Xuan; Pan, Lei; Wang, Zhi-Jie; Ni, Hao-Fei; Zhang, Feng-Wen; Teri, Gele; Zhang, Zhi-Xu; Liu, Zunqi; Fu, Da-Wei; Zhang, Yi |
Journal of publication | Chemical science |
Year of publication | 2025 |
Journal volume | 16 |
Journal issue | 9 |
Pages of publication | 4101 - 4108 |
a | 11.9665 ± 0.0015 Å |
b | 10.5773 ± 0.0013 Å |
c | 19.8113 ± 0.0019 Å |
α | 90° |
β | 100.165 ± 0.008° |
γ | 90° |
Cell volume | 2468.2 ± 0.5 Å3 |
Cell temperature | 300 K |
Ambient diffraction temperature | 300 K |
Number of distinct elements | 6 |
Space group number | 14 |
Hermann-Mauguin space group symbol | P 1 21/n 1 |
Hall space group symbol | -P 2yn |
Residual factor for all reflections | 0.1641 |
Residual factor for significantly intense reflections | 0.1246 |
Weighted residual factors for significantly intense reflections | 0.2377 |
Weighted residual factors for all reflections included in the refinement | 0.2549 |
Goodness-of-fit parameter for all reflections included in the refinement | 0.999 |
Diffraction radiation wavelength | 1.54184 Å |
Diffraction radiation type | CuKα |