Information card for entry 1573857
Formula | C26 H18 N2 O4 |
Calculated formula | C26 H18 N2 O4 |
Title of publication | Non-Conjugated Alkyl Chains Engineering to Tune Condensed State Photophysical and Supramolecular Assembly Properties |
Authors of publication | Meher, Niranjan; Khatun, Mst Nasima; Parui, Retwik; Iyer, Parameswar K. |
Journal of publication | Nanoscale |
Year of publication | 2025 |
a | 18.691 ± 0.002 Å |
b | 3.898 ± 0.0005 Å |
c | 26.717 ± 0.003 Å |
α | 90° |
β | 90.349 ± 0.004° |
γ | 90° |
Cell volume | 1946.5 ± 0.4 Å3 |
Cell temperature | 295 K |
Ambient diffraction temperature | 295 K |
Number of distinct elements | 4 |
Space group number | 14 |
Hermann-Mauguin space group symbol | P 1 21/c 1 |
Hall space group symbol | -P 2ybc |
Residual factor for all reflections | 0.13 |
Residual factor for significantly intense reflections | 0.0832 |
Weighted residual factors for significantly intense reflections | 0.1479 |
Weighted residual factors for all reflections included in the refinement | 0.1689 |
Goodness-of-fit parameter for all reflections included in the refinement | 1.185 |
Diffraction radiation wavelength | 0.71073 Å |
Diffraction radiation type | MoKα |