Information card for entry 1573858
Formula | C14 H11 N O2 |
Calculated formula | C14 H11 N O2 |
Title of publication | Non-Conjugated Alkyl Chains Engineering to Tune Condensed State Photophysical and Supramolecular Assembly Properties |
Authors of publication | Meher, Niranjan; Khatun, Mst Nasima; Parui, Retwik; Iyer, Parameswar K. |
Journal of publication | Nanoscale |
Year of publication | 2025 |
a | 7.0702 ± 0.0013 Å |
b | 18.754 ± 0.004 Å |
c | 16.522 ± 0.003 Å |
α | 90° |
β | 96.935 ± 0.005° |
γ | 90° |
Cell volume | 2174.7 ± 0.7 Å3 |
Cell temperature | 297 ± 2 K |
Ambient diffraction temperature | 297 ± 2 K |
Number of distinct elements | 4 |
Space group number | 15 |
Hermann-Mauguin space group symbol | C 1 2/c 1 |
Hall space group symbol | -C 2yc |
Residual factor for all reflections | 0.0788 |
Residual factor for significantly intense reflections | 0.0546 |
Weighted residual factors for significantly intense reflections | 0.1631 |
Weighted residual factors for all reflections included in the refinement | 0.1948 |
Goodness-of-fit parameter for all reflections included in the refinement | 1.339 |
Diffraction radiation wavelength | 0.71073 Å |
Diffraction radiation type | MoKα |