Information card for entry 9013711
External links | AMCSD |
Mineral name | Pigeonite |
Formula | Al0.02 Ca0.121 Fe1.008 Mg0.871 O6 Si1.98 |
Calculated formula | Al0.02 Ca0.121 Fe1.008 Mg0.871 O6 Si1.98 |
Title of publication | High-pressure phase transition of a natural pigeonite Note: P = 3.172 GPa |
Authors of publication | Alvaro, M.; Nestola, F.; Ballaran, T. B.; Camara, F.; Domeneghetti, M. C.; Tazzoli, V. |
Journal of publication | American Mineralogist |
Year of publication | 2010 |
Journal volume | 95 |
Pages of publication | 300 - 311 |
a | 9.622 Å |
b | 8.861 Å |
c | 5.181 Å |
α | 90° |
β | 107.92° |
γ | 90° |
Cell volume | 420.305 Å3 |
Ambient diffracton pressure | 3172000 kPa |
Number of distinct elements | 6 |
Space group number | 14 |
Hermann-Mauguin space group symbol | P 1 21/c 1 |
Hall space group symbol | -P 2ybc |