Information card for entry 9013712
External links | AMCSD |
Mineral name | Pigeonite |
Formula | Al2 Ca0.121 Fe1.008 Mg0.871 O6 Si2 |
Calculated formula | Al2 Ca0.121 Fe1.008 Mg0.871 O6 Si2 |
Title of publication | High-pressure phase transition of a natural pigeonite Note: P = 3.587 GPa |
Authors of publication | Alvaro, M.; Nestola, F.; Ballaran, T. B.; Camara, F.; Domeneghetti, M. C.; Tazzoli, V. |
Journal of publication | American Mineralogist |
Year of publication | 2010 |
Journal volume | 95 |
Pages of publication | 300 - 311 |
a | 9.518 Å |
b | 8.804 Å |
c | 5.056 Å |
α | 90° |
β | 104.04° |
γ | 90° |
Cell volume | 411.018 Å3 |
Ambient diffracton pressure | 3587000 kPa |
Number of distinct elements | 6 |
Space group number | 15 |
Hermann-Mauguin space group symbol | C 1 2/c 1 |
Hall space group symbol | -C 2yc |