Information card for entry 9013713
External links | AMCSD |
Mineral name | Pigeonite |
Formula | Al0.02 Ca0.121 Fe1.008 Mg0.871 O6 Si1.98 |
Calculated formula | Al0.02 Ca0.121 Fe1.008 Mg0.871 O6 Si1.98 |
Title of publication | High-pressure phase transition of a natural pigeonite Note: P = 3.649 GPa |
Authors of publication | Alvaro, M.; Nestola, F.; Ballaran, T. B.; Camara, F.; Domeneghetti, M. C.; Tazzoli, V. |
Journal of publication | American Mineralogist |
Year of publication | 2010 |
Journal volume | 95 |
Pages of publication | 300 - 311 |
a | 9.494 Å |
b | 8.818 Å |
c | 5.06 Å |
α | 90° |
β | 104.11° |
γ | 90° |
Cell volume | 410.833 Å3 |
Ambient diffracton pressure | 3649000 kPa |
Number of distinct elements | 6 |
Space group number | 15 |
Hermann-Mauguin space group symbol | C 1 2/c 1 |
Hall space group symbol | -C 2yc |